{"text_format":"1","workbook":"xlsx","n_sheets":3,"sheets":["Analysis (2)","Synthesis","Analysis"],"not_rendered":{"charts":3,"images":5,"macros":1,"external_links":1,"defined_names":2,"comments":2,"pivot_tables":0},"unopened":[],"bounds":{"document_bytes":16777216,"sheet_cells":100000,"rows_first":2000,"rows_last":500,"rows_between":2000,"halvings":0,"cell_chars":16384,"cell_head_chars":4096},"cells_cut":0,"cells_raw":0,"read":"whole","date_system":"1900"}

{"sheet":"Analysis (2)","index":0,"n_rows":27,"n_cols":21,"rows_kept":27,"cut":false,"hidden":false,"merged":[]}
[null,null,null,null,null,null,null,null,null,null,null,null,{"$f":"PI()/180","v":1.7453292519943295E-2}]
["b2","-Z1",null,"R1",null,"-Z2",null,"R2"]
[{"$f":"A4*0.5","v":273},{"$f":"VLOOKUP(A3,Synthesis!$A$8:$L$728,5)","v":-63.020293968845046},{"$f":"VLOOKUP(A3,Synthesis!$A$8:$L$728,6)","v":185.68766557589029},{"$f":"VLOOKUP($A$3,Synthesis!$A$8:$L$728,7)","v":195.04672482329929},{"$f":"VLOOKUP($A$3,Synthesis!$A$8:$L$728,8)","v":230.30965304779406},{"$f":"VLOOKUP($A$3,Synthesis!$A$8:$L$728,9)","v":136.96544621548631},{"$f":"VLOOKUP($A$3,Synthesis!$A$8:$L$728,10)","v":-219.86374220466462},{"$f":"VLOOKUP($A$3,Synthesis!$A$8:$L$728,11)","v":395.03246500763066},{"$f":"VLOOKUP($A$3,Synthesis!$A$8:$L$728,12)","v":-175.24175473276085}]
[546,1,null,null,null,null,null,null,null,null,null,null,null,null,null,null,null,null,50,1]
[{"$f":"A6*0.5","v":72},{"$f":"VLOOKUP(A5,Synthesis!$A$8:$L$728,5)","v":390.3441402911352},{"$f":"VLOOKUP(A5,Synthesis!$A$8:$L$728,6)","v":-238.04512691387202},{"$f":"VLOOKUP($A$5,Synthesis!$A$8:$L$728,7)","v":283.88685222045916},{"$f":"VLOOKUP($A$5,Synthesis!$A$8:$L$728,8)","v":49.593065133245318},{"$f":"VLOOKUP($A$5,Synthesis!$A$8:$L$728,9)","v":-59.898497281735963},{"$f":"VLOOKUP($A$5,Synthesis!$A$8:$L$728,10)","v":-152.89403506758694},{"$f":"VLOOKUP($A$5,Synthesis!$A$8:$L$728,11)","v":-166.355785352412},{"$f":"VLOOKUP($A$5,Synthesis!$A$8:$L$728,12)","v":134.7441569795304},null,null,null,null,null,"f-pi()/2",{"$f":"P6*180/PI()-90","v":18.746631391339662},null,null,null,0,{"$f":"+S4","v":50}]
[144,2,null,null,null,null,null,null,null,null,null,null,{"$f":"360+M9","v":554.81168197417105},null,"f",{"$f":"ATAN2(H12,I12)","v":1.8979867682314993},null,null,null,0,0]
[null,null,null,"Selected Values",null,"Z",null,"R",null,null,"g3",{"$f":"ACOS((L13^2+L9^2-L8^2)/(2*L9*L13))","v":0.31797048589299082},{"$f":"L7/D_R","v":18.218366851392453},null,null,null,null,null,null,{"$f":"+S4","v":50},0]
[null,-60.953650056469662,null,null,null,{"$f":"IF($B$4=1,B3,F3)","v":-63.020293968845046},{"$f":"IF($B$4=1,C3,G3)","v":185.68766557589029},195.04672482329929,230.30965304779406,null,"c3",{"$f":"SQRT(H13^2+I13^2)","v":164.20845269308958},null,null,null,{"$f":"SQRT(O12^2+O12^2)","v":94.539673053336529}]
[null,null,null,null,null,{"$f":"IF($B$6=1,B5,F5)","v":-59.898497281735963},{"$f":"IF($B$6=1,C5,G5)","v":-152.89403506758694},-166.355785352412,134.7441569795304,null,"b3",{"$f":"SQRT(H12^2+I12^2)","v":196.09045514492365},{"$f":"360+M10","v":194.81168197417108},null,null,null,null,null,null,2]
[null,null,null,null,null,null,null,"X","Y",null,"alpha",{"$f":"ATAN2(H14-H11,I14-I11)","v":-2.8830800353822141},{"$f":"M11/D_R","v":-165.18831802582892},null,"X","Y",null,null,null,{"$f":"+T11-S4*SIN([1]Synthesis!E8)","v":75},{"$f":"+U11+S4*COS([1]Synthesis!E8)","v":243.30127018922195}]
[null,null,null,null,null,null,"A0",{"$f":"H8","v":195.04672482329929},{"$f":"I8","v":230.30965304779406},null,"a1",{"$f":"SQRT((H11-H14)^2+(I11-I14)^2)","v":373.8242078839711},{"$f":"ATAN2((H14-H11),(I14-I11))","v":-2.8830800353822141},"A0",{"$f":"H11","v":195.04672482329929},{"$f":"I11","v":230.30965304779406},null,null,null,{"$f":"+[1]Synthesis!B8","v":100},{"$f":"+[1]Synthesis!C8","v":200}]
[null,null,null,null,null,null,"A",{"$f":"F8","v":-63.020293968845046},{"$f":"G8","v":185.68766557589029},null,"a2",{"$f":"SQRT((H12-H11)^2+(I12-I11)^2)","v":261.89636873047266},null,"A",{"$f":"O11+L12*COS(B17+L10)","v":-66.849643907173373},{"$f":"P11+L12*SIN(B17+L10)","v":230.30965304779409},null,null,null,{"$f":"+T11+S4*COS([1]Synthesis!E8)","v":143.30127018922195},{"$f":"+U11+S4*SIN([1]Synthesis!E8)","v":225}]
[null,null,null,null,null,null,"B",{"$f":"F9","v":-59.898497281735963},{"$f":"G9","v":-152.89403506758694},null,"a3",{"$f":"SQRT((H12-H13)^2+(I12-I13)^2)","v":338.59609215876202},null,"B",{"$f":"O14+L14*COS(I17)","v":42.022348944567824},{"$f":"P14+L14*SIN(I17)","v":-90.305697173737315},{"$f":"O13","v":42.022348944567824},{"$f":"P13","v":-90.305697173737315}]
[null,null,null,null,null,null,"B0",{"$f":"H9","v":-166.355785352412},{"$f":"I9","v":134.7441569795304},null,"a4",{"$f":"SQRT((H13-H14)^2+(I13-I14)^2)","v":306.70651070281707},{"$f":"ATAN2((H13-H14),(I13-I14))","v":-1.2163211342655262},"B0",{"$f":"H14","v":-166.355785352412},{"$f":"I14","v":134.7441569795304},{"$f":"O15","v":51.09059603953142},{"$f":"P15","v":73.65217189781194},null,3]
[null,null,null,null,null,null,null,null,null,"q13",null,null,{"$f":"M14/D_R","v":-69.690067525979785},"P",{"$f":"O12+L9*COS(J16+L7)","v":51.09059603953142},{"$f":"P12+L9*SIN(J16+L7)","v":73.65217189781194},{"$f":"O12","v":-66.849643907173373},{"$f":"P12","v":230.30965304779409},null,{"$f":"+T16-S4*SIN([1]Synthesis!E7)","v":200},{"$f":"+U16+S4*COS([1]Synthesis!E7)","v":350}]
["q12(degrees)","radians","Xa","Ya","s","f","m","y","q14",{"$f":"I17-G17","v":-7.5266268352595453},null,null,null,"C",{"$f":"O15+S4*COS(J21*PI()/180-P5*PI()/180-PI())","v":35.450818961426613},{"$f":"P15+S4*SIN(J21*PI()/180-P5*PI()/180-PI())","v":121.14319602813774},null,null,null,{"$f":"+[1]Synthesis!B7","v":200},{"$f":"+[1]Synthesis!C7","v":300}]
[{"$f":"MOD(A18*0.01,360)","v":180},{"$f":"A17*PI()/180-$L$10","v":6.0246726889720073},{"$f":"-L11+L12*COS(B17)","v":-120.63031870043727},{"$f":"L12*SIN(B17)","v":-66.951941228944975},{"$f":"SQRT(C17^2+D17^2)","v":137.96461946489458},{"$f":"ATAN2(C17,D17)","v":-2.6349053777339333},{"$f":"ACOS((L13^2+L14^2-E17^2)/(2*L13*L14))","v":0.41959752032267295},{"$f":"ACOS((L14^2+E17^2-L13^2)/(2*L14*E17))","v":1.5890439018207243},{"$f":"F17-H17+L10","v":-7.107029314936872},{"$f":"J16*180/PI()","v":-431.24395163027947},null,null,null,"E",{"$f":"O18+50*COS(J21*PI()/180-P5*PI()/180-PI())","v":59.196331026589512},{"$f":"P18+50*SIN(J21*PI()/180-P5*PI()/180-PI())","v":128.96308456719015},null,null,null,{"$f":"+T16+S4*COS([1]Synthesis!E7)","v":250},{"$f":"+U16+S4*SIN([1]Synthesis!E7)","v":300}]
[18000,null,null,null,null,null,null,null,null,{"$f":"J17+360","v":-71.243951630279469},null,null,null,"D",{"$f":"O15+25*COS(J21*PI()/180-P6-PI())","v":74.836108104694318},{"$f":"P15+25*SIN(J21*PI()/180-P6-PI())","v":81.472060436864339}]
[null,null,null,null,null,null,null,null,null,{"$f":"J18+360","v":288.75604836972053},null,null,null,"P",{"$f":"O15","v":51.09059603953142},{"$f":"P15","v":73.65217189781194},null,null,null,4]
[null,null,null,null,null,null,null,null,null,null,null,null,null,null,{"$f":"J21*PI()/180-P6-PI()","v":0.31813484317132623},null,null,null,null,{"$f":"+T21-S4*SIN([1]Synthesis!E9)","v":343.30127018922195},{"$f":"+U21+S4*COS([1]Synthesis!E9)","v":225}]
{"$rows_left_out":8}
{"sheet":"Synthesis","index":1,"n_rows":728,"n_cols":22,"rows_kept":728,"cut":false,"hidden":false,"merged":[]}
[]
[null,null,null,null,null,null,null,null,null,null,"b2","(radians)","b41","b42","-Z1x","-Z1y","R1x","R1y","-Z2x","-Z2y","R2x","R12y"]
["d3",200,300,"a3",0,0,null,null,null,null,15,{"$f":"K3*PI()/180","v":0.26179938779914941},{"$f":"Burmester(B3:C3,B4:C4,B5:C5,E3,E4,E5,L3)","v":5.4369034902695876},0.21663777125204298,{"$f":"ThreePosition_Basic2(E3,E5,B3:C3,B5:C5,L3,M3)","v":1247.3964286397029},-817.42819182766232,208.03331173092965,92.147219444852681,{"$f":"ThreePosition_Basic2(E3,E5,B3:C3,B5:C5,L3,N3)","v":25.707448341579557},-133.86443325253501,-1013.6556685671936,775.71097801997996]
["d2",100,200,"a2",0.52359877600000004,30]
["d4",300,200,"a4",-1.047197551,60]
[]
["b2",null,"b41","b42","-Z1",null,"R1",null,"-Z2",null,"R2"]
[0,{"$f":"A8*PI()/180","v":0},{"$f":"Burmester($B$3:$C$3,$B$4:$C$4,$B$5:$C$5,$E$3,$E$4,$E$5,B8)","v":5.2359877561795862},6.3180372721346664E-16,{"$f":"ThreePosition_Basic2($E$3,$E$5,$B$3:$C$3,$B$5:$C$5,B8,C8)","v":{"$error":"#VALUE!"}},{"$error":"#VALUE!"},{"$error":"#VALUE!"},{"$error":"#VALUE!"},{"$f":"ThreePosition_Basic2($E$3,$E$5,$B$3:$C$3,$B$5:$C$5,B8,D8)","v":-8374471.4511781354},-12561707.176767202,-2.1420194314296859E+22,-1.0591140122101253E+22]
[0.5,{"$f":"A9*PI()/180","v":8.7266462599716477E-3},{"$f":"Burmester($B$3:$C$3,$B$4:$C$4,$B$5:$C$5,$E$3,$E$4,$E$5,B9)","v":5.2433487235420611},6.5554831685672877E-3,{"$f":"ThreePosition_Basic2($E$3,$E$5,$B$3:$C$3,$B$5:$C$5,B9,C9)","v":34465.842205779474},-22955.256737204672,188.59266436294274,112.90962373934235,{"$f":"ThreePosition_Basic2($E$3,$E$5,$B$3:$C$3,$B$5:$C$5,B9,D9)","v":52.935212390315563},-142.08245957128776,-34224.314329026216,22926.083901372727]
[1,1.7453292519943295E-2,{"$f":"Burmester($B$3:$C$3,$B$4:$C$4,$B$5:$C$5,$E$3,$E$4,$E$5,B10)","v":5.2506634306873021},1.3156170890675065E-2,{"$f":"ThreePosition_Basic2($E$3,$E$5,$B$3:$C$3,$B$5:$C$5,B10,C10)","v":17277.504754538168},-11496.716910803874,189.20723514161364,112.14810212706652,{"$f":"ThreePosition_Basic2($E$3,$E$5,$B$3:$C$3,$B$5:$C$5,B10,D10)","v":52.02131265175003},-141.73300022690555,-17036.276206744806,11467.132012704034]
[1.5,2.6179938779914941E-2,{"$f":"Burmester($B$3:$C$3,$B$4:$C$4,$B$5:$C$5,$E$3,$E$4,$E$5,B11)","v":5.2579318496995793},1.9802219091760925E-2,{"$f":"ThreePosition_Basic2($E$3,$E$5,$B$3:$C$3,$B$5:$C$5,B11,C11)","v":11548.328245607958},-7677.6118099409441,189.82684893749683,111.38912117264408,{"$f":"ThreePosition_Basic2($E$3,$E$5,$B$3:$C$3,$B$5:$C$5,B11,D11)","v":51.104564942991679},-141.38755504556664,-11307.396831727468,7647.6133760680214]
[2,3.4906585039886591E-2,{"$f":"Burmester($B$3:$C$3,$B$4:$C$4,$B$5:$C$5,$E$3,$E$4,$E$5,B12)","v":5.2651539642237157},2.6493772070240215E-2,{"$f":"ThreePosition_Basic2($E$3,$E$5,$B$3:$C$3,$B$5:$C$5,B12,C12)","v":8683.945638197245},-5768.3633977279233,190.45139358331471,110.63276534804663,{"$f":"ThreePosition_Basic2($E$3,$E$5,$B$3:$C$3,$B$5:$C$5,B12,D12)","v":50.185081028962209},-141.04620679811023,-8443.3091635849687,5737.9499562778601]
[2.5,4.3633231299858237E-2,{"$f":"Burmester($B$3:$C$3,$B$4:$C$4,$B$5:$C$5,$E$3,$E$4,$E$5,B13)","v":5.2723297695742755},3.323096239748688E-2,{"$f":"ThreePosition_Basic2($E$3,$E$5,$B$3:$C$3,$B$5:$C$5,B13,C13)","v":6965.4834318177172},-4623.0559987931319,191.08075564499904,109.8791186553135,{"$f":"ThreePosition_Basic2($E$3,$E$5,$B$3:$C$3,$B$5:$C$5,B13,D13)","v":49.262974091542951},-140.7090379014283,-6725.1397020811755,4592.2260795470174]
[3,5.2359877559829883E-2,{"$f":"Burmester($B$3:$C$3,$B$4:$C$4,$B$5:$C$5,$E$3,$E$4,$E$5,B14)","v":5.2794592728298486},4.0013910832708562E-2,{"$f":"ThreePosition_Basic2($E$3,$E$5,$B$3:$C$3,$B$5:$C$5,B14,C14)","v":5819.9837150584735},-3859.7176651404689,191.71482050462055,109.12826456209086,{"$f":"ThreePosition_Basic2($E$3,$E$5,$B$3:$C$3,$B$5:$C$5,B14,D14)","v":48.338358647803005},-140.37613035220849,-5579.93053590605,3828.4697993503514]
[3.5,6.1086523819801536E-2,{"$f":"Burmester($B$3:$C$3,$B$4:$C$4,$B$5:$C$5,$E$3,$E$4,$E$5,B15)","v":5.2865424929121518},4.6842726253006478E-2,{"$f":"ThreePosition_Basic2($E$3,$E$5,$B$3:$C$3,$B$5:$C$5,B15,C15)","v":5001.8930297702282},-3314.6460856123344,192.35347244553577,108.38028593745321,{"$f":"ThreePosition_Basic2($E$3,$E$5,$B$3:$C$3,$B$5:$C$5,B15,D15)","v":47.411350465961497},-140.04756566098433,-4762.1282068587307,3282.9788058888034]
[4,6.9813170079773182E-2,{"$f":"Burmester($B$3:$C$3,$B$4:$C$4,$B$5:$C$5,$E$3,$E$4,$E$5,B16)","v":5.2935794606497248},5.3717505598835515E-2,{"$f":"ThreePosition_Basic2($E$3,$E$5,$B$3:$C$3,$B$5:$C$5,B16,C16)","v":4388.4345871768564},-2905.9900633033603,192.99659473951488,107.63526498819647,{"$f":"ThreePosition_Basic2($E$3,$E$5,$B$3:$C$3,$B$5:$C$5,B16,D16)","v":46.482066479394035},-139.72342478664581,-4148.9559259579473,2873.9019035049109]
[4.5,7.8539816339744828E-2,{"$f":"Burmester($B$3:$C$3,$B$4:$C$4,$B$5:$C$5,$E$3,$E$4,$E$5,B17)","v":5.3005702188260466},6.0638333835044356E-2,{"$f":"ThreePosition_Basic2($E$3,$E$5,$B$3:$C$3,$B$5:$C$5,B17,C17)","v":3911.3990066392325},-2588.2766747399455,193.64406973567111,106.89328319576452,{"$f":"ThreePosition_Basic2($E$3,$E$5,$B$3:$C$3,$B$5:$C$5,B17,D17)","v":45.550624698863096},-139.40378807157245,-3672.2043122046985,2555.7661698641377]
[5,8.7266462599716474E-2,{"$f":"Burmester($B$3:$C$3,$B$4:$C$4,$B$5:$C$5,$E$3,$E$4,$E$5,B18)","v":5.3075148222119166},6.7605283927645185E-2,{"$f":"ThreePosition_Basic2($E$3,$E$5,$B$3:$C$3,$B$5:$C$5,B18,C18)","v":3529.860611215714},-2334.2221335892596,194.2957789510333,106.15442125386426,{"$f":"ThreePosition_Basic2($E$3,$E$5,$B$3:$C$3,$B$5:$C$5,B18,D18)","v":44.617144123088494},-139.08873517752417,-3290.9476881415922,2301.2878196655997]
[5.5,9.599310885968812E-2,{"$f":"Burmester($B$3:$C$3,$B$4:$C$4,$B$5:$C$5,$E$3,$E$4,$E$5,B19)","v":5.3144133375820442},7.4618416836383539E-2,{"$f":"ThreePosition_Basic2($E$3,$E$5,$B$3:$C$3,$B$5:$C$5,B19,C19)","v":3217.7757438767144},-2126.4640014690881,194.95160316248666,105.41875900706236,{"$f":"ThreePosition_Basic2($E$3,$E$5,$B$3:$C$3,$B$5:$C$5,B19,D19)","v":43.681744647956485},-138.77834502244866,-2979.1423960662714,2093.1044154537017]
[6,0.10471975511965977,{"$f":"Burmester($B$3:$C$3,$B$4:$C$4,$B$5:$C$5,$E$3,$E$4,$E$5,B20)","v":5.3212658437157847},8.1677781523151152E-2,{"$f":"ThreePosition_Basic2($E$3,$E$5,$B$3:$C$3,$B$5:$C$5,B20,C20)","v":2957.7819256591742},-1953.427293382442,195.61142249994236,104.6863753903815,{"$f":"ThreePosition_Basic2($E$3,$E$5,$B$3:$C$3,$B$5:$C$5,B20,D20)","v":42.744546974541173},-138.47269571833996,-2719.4259561846907,1919.6409730544835]
{"$rows_left_out":709}
{"sheet":"Analysis","index":2,"n_rows":27,"n_cols":21,"rows_kept":27,"cut":false,"hidden":false,"merged":[]}
[null,null,null,null,null,null,null,null,null,null,null,null,{"$f":"PI()/180","v":1.7453292519943295E-2}]
["b2","-Z1",null,"R1",null,"-Z2",null,"R2"]
[{"$f":"A4*0.5","v":273},{"$f":"VLOOKUP(A3,Synthesis!$A$8:$L$728,5)","v":-63.020293968845046},{"$f":"VLOOKUP(A3,Synthesis!$A$8:$L$728,6)","v":185.68766557589029},{"$f":"VLOOKUP($A$3,Synthesis!$A$8:$L$728,7)","v":195.04672482329929},{"$f":"VLOOKUP($A$3,Synthesis!$A$8:$L$728,8)","v":230.30965304779406},{"$f":"VLOOKUP($A$3,Synthesis!$A$8:$L$728,9)","v":136.96544621548631},{"$f":"VLOOKUP($A$3,Synthesis!$A$8:$L$728,10)","v":-219.86374220466462},{"$f":"VLOOKUP($A$3,Synthesis!$A$8:$L$728,11)","v":395.03246500763066},{"$f":"VLOOKUP($A$3,Synthesis!$A$8:$L$728,12)","v":-175.24175473276085}]
[546,1,null,null,null,null,null,null,null,null,null,null,null,null,null,null,null,null,50,1]
[{"$f":"A6*0.5","v":72},{"$f":"VLOOKUP(A5,Synthesis!$A$8:$L$728,5)","v":390.3441402911352},{"$f":"VLOOKUP(A5,Synthesis!$A$8:$L$728,6)","v":-238.04512691387202},{"$f":"VLOOKUP($A$5,Synthesis!$A$8:$L$728,7)","v":283.88685222045916},{"$f":"VLOOKUP($A$5,Synthesis!$A$8:$L$728,8)","v":49.593065133245318},{"$f":"VLOOKUP($A$5,Synthesis!$A$8:$L$728,9)","v":-59.898497281735963},{"$f":"VLOOKUP($A$5,Synthesis!$A$8:$L$728,10)","v":-152.89403506758694},{"$f":"VLOOKUP($A$5,Synthesis!$A$8:$L$728,11)","v":-166.355785352412},{"$f":"VLOOKUP($A$5,Synthesis!$A$8:$L$728,12)","v":134.7441569795304},null,null,null,null,null,"f-pi()/2",{"$f":"P6*180/PI()-90","v":18.746631391339662},null,null,null,0,{"$f":"+S4","v":50}]
[144,2,null,null,null,null,null,null,null,null,null,null,{"$f":"360+M9","v":554.81168197417105},null,"f",{"$f":"ATAN2(H12,I12)","v":1.8979867682314993},null,null,null,0,0]
[null,null,null,"Selected Values",null,"Z",null,"R",null,null,"g3",{"$f":"ACOS((L13^2+L9^2-L8^2)/(2*L9*L13))","v":0.31797048589299082},{"$f":"L7/D_R","v":18.218366851392453},null,null,null,null,null,null,{"$f":"+S4","v":50},0]
[null,-60.953650056469662,null,null,null,{"$f":"IF($B$4=1,B3,F3)","v":-63.020293968845046},{"$f":"IF($B$4=1,C3,G3)","v":185.68766557589029},195.04672482329929,230.30965304779406,null,"c3",{"$f":"SQRT(H13^2+I13^2)","v":164.20845269308958},null,null,null,{"$f":"SQRT(O12^2+O12^2)","v":118.13869800767063}]
[null,null,null,null,null,{"$f":"IF($B$6=1,B5,F5)","v":-59.898497281735963},{"$f":"IF($B$6=1,C5,G5)","v":-152.89403506758694},-166.355785352412,134.7441569795304,null,"b3",{"$f":"SQRT(H12^2+I12^2)","v":196.09045514492365},{"$f":"360+M10","v":194.81168197417108},null,null,null,null,null,null,2]
[null,null,null,null,null,null,null,"X","Y",null,"alpha",{"$f":"ATAN2(H14-H11,I14-I11)","v":-2.8830800353822141},{"$f":"M11/D_R","v":-165.18831802582892},null,"X","Y",null,null,null,{"$f":"+T11-S4*SIN([1]Synthesis!E8)","v":75},{"$f":"+U11+S4*COS([1]Synthesis!E8)","v":243.30127018922195}]
[null,null,null,null,null,null,"A0",{"$f":"H8","v":195.04672482329929},{"$f":"I8","v":230.30965304779406},null,"a1",{"$f":"SQRT((H11-H14)^2+(I11-I14)^2)","v":373.8242078839711},{"$f":"ATAN2((H14-H11),(I14-I11))","v":-2.8830800353822141},"A0",{"$f":"H11","v":195.04672482329929},{"$f":"I11","v":230.30965304779406},null,null,null,{"$f":"+[1]Synthesis!B8","v":100},{"$f":"+[1]Synthesis!C8","v":200}]
[null,null,null,null,null,null,"A",{"$f":"F8","v":-63.020293968845046},{"$f":"G8","v":185.68766557589029},null,"a2",{"$f":"SQRT((H12-H11)^2+(I12-I11)^2)","v":261.89636873047266},null,"A",{"$f":"O11+L12*COS(B17+L10)","v":83.536674481773574},{"$f":"P11+L12*SIN(B17+L10)","v":467.28057241774138},null,null,null,{"$f":"+T11+S4*COS([1]Synthesis!E8)","v":143.30127018922195},{"$f":"+U11+S4*SIN([1]Synthesis!E8)","v":225}]
[null,null,null,null,null,null,"B",{"$f":"F9","v":-59.898497281735963},{"$f":"G9","v":-152.89403506758694},null,"a3",{"$f":"SQRT((H12-H13)^2+(I12-I13)^2)","v":338.59609215876202},null,"B",{"$f":"O14+L14*COS(I17)","v":140.34813889455853},{"$f":"P14+L14*SIN(I17)","v":133.48457014021298},{"$f":"O13","v":140.34813889455853},{"$f":"P13","v":133.48457014021298}]
[null,null,null,null,null,null,"B0",{"$f":"H9","v":-166.355785352412},{"$f":"I9","v":134.7441569795304},null,"a4",{"$f":"SQRT((H13-H14)^2+(I13-I14)^2)","v":306.70651070281707},{"$f":"ATAN2((H13-H14),(I13-I14))","v":-1.2163211342655262},"B0",{"$f":"H14","v":-166.355785352412},{"$f":"I14","v":134.7441569795304},{"$f":"O15","v":175.22502174205962},{"$f":"P15","v":293.94646274621562},null,3]
[null,null,null,null,null,null,null,null,null,"q13",null,null,{"$f":"M14/D_R","v":-69.690067525979785},"P",{"$f":"O12+L9*COS(J16+L7)","v":175.22502174205962},{"$f":"P12+L9*SIN(J16+L7)","v":293.94646274621562},{"$f":"O12","v":83.536674481773574},{"$f":"P12","v":467.28057241774138},null,{"$f":"+T16-S4*SIN([1]Synthesis!E7)","v":200},{"$f":"+U16+S4*COS([1]Synthesis!E7)","v":350}]
["q12(degrees)","radians","Xa","Ya","s","f","m","y","q14",{"$f":"I17-G17","v":-7.6853988919853728},null,null,null,"C",{"$f":"O15+S4*COS(J21*PI()/180-P5*PI()/180-PI())","v":167.2905667567793},{"$f":"P15+S4*SIN(J21*PI()/180-P5*PI()/180-PI())","v":343.31289287931884},null,null,null,{"$f":"+[1]Synthesis!B7","v":200},{"$f":"+[1]Synthesis!C7","v":300}]
[{"$f":"MOD(A18*0.01,360)","v":115.2},{"$f":"A17*PI()/180-$L$10","v":4.8936993336796819},{"$f":"-L11+L12*COS(B17)","v":-326.59942075786495},{"$f":"L12*SIN(B17)","v":-257.60343055771142},{"$f":"SQRT(C17^2+D17^2)","v":415.9647930708494},{"$f":"ATAN2(C17,D17)","v":-2.4737527265147703},{"$f":"ACOS((L13^2+L14^2-E17^2)/(2*L13*L14))","v":1.3981067584552749},{"$f":"ACOS((L14^2+E17^2-L13^2)/(2*L14*E17))","v":0.93045937163311299},{"$f":"F17-H17+L10","v":-6.287292133530098},{"$f":"J16*180/PI()","v":-440.34092038528109},null,null,null,"E",{"$f":"O18+50*COS(J21*PI()/180-P5*PI()/180-PI())","v":191.97378182333091},{"$f":"P18+50*SIN(J21*PI()/180-P5*PI()/180-PI())","v":347.28012037195901},null,null,null,{"$f":"+T16+S4*COS([1]Synthesis!E7)","v":250},{"$f":"+U16+S4*SIN([1]Synthesis!E7)","v":300}]
[11520,null,null,null,null,null,null,null,null,{"$f":"J17+360","v":-80.340920385281095},null,null,null,"D",{"$f":"O15+25*COS(J21*PI()/180-P6-PI())","v":199.90823680861124},{"$f":"P15+25*SIN(J21*PI()/180-P6-PI())","v":297.91369023885579}]
[null,null,null,null,null,null,null,null,null,{"$f":"J18+360","v":279.65907961471891},null,null,null,"P",{"$f":"O15","v":175.22502174205962},{"$f":"P15","v":293.94646274621562},null,null,null,4]
[null,null,null,null,null,null,null,null,null,null,null,null,null,null,{"$f":"J21*PI()/180-P6-PI()","v":0.15936278644549784},null,null,null,null,{"$f":"+T21-S4*SIN([1]Synthesis!E9)","v":343.30127018922195},{"$f":"+U21+S4*COS([1]Synthesis!E9)","v":225}]
{"$rows_left_out":7}